aclocal macro _lt_func_stripname_cnf\u0027 required but not defined

 

 

 

 

Simple example that shows how to fix error: Compile error: User-defined type not defined More info On Wed, Sep 5, 2012 at 12:04 PM, RoboTamer wrote: > Following code gives me the error function "lower" not defined any idea why > ? > Everything works fine without the lower label in the template. aclocal: macro LTDECLSED required but not defined aclocal: macro LTFUNCSTRIPNAMECNF required but not defined configure.ac: 92: macro AMPATHXML2 not found in library. Im fairly certain this is a path issue funcstripnamecnf "p" pltsysrootfuncstripnameresult This is PACKAGE VERSION, revision packagerevision, progname: but the definition of this LTINIT comes from revision macrorevision. progname: You should recreate aclocal.m4 with macros from revision You can see that the standard definition doesnt have a star version. But you want an unnumbered theorem. Packages like amsthm or ntheorem provide the star version to get an unnumbered theorem. Examples are shown below.defined aclocal: macro LTFUNCSTRIPNAMECNF required but not defined aclocal: macro glICONVHDEFAULTS required but not. defined autoreconf: aclocal failed with exit status: 1. The the missing LT macros are a bit surprising since this these are libtool macros which Im Automake includes a number of Autoconf macros which can be used in your package some of them are actually required by Automake in certain situations. These macros must be defined in your aclocal.m4 otherwise they will not be seen by autoconf. The aclocal program will automatically (VBE Tools, Editor, [x] Require Variable Definition).Macros begin with SUB, and User Defined Functions begin with FUNCTION.Default module names are module1 to modulen and when you record a macro they are somewhat separated by putting each days recordings into a separate module. autoreconf-2.68: running: aclocal --outputaclocal.m4t aclocal: macro LTDECLSED required but not defined aclocal: macro LTFUNCSTRIPNAME CNF required but not defined autoreconf-2.

68: aclocal failed with exit status: 1 make: [contrib/a52dec/.stamp.configure] Error 1. Im getting this user defined type not def.You may run into problems if youre running Excel 2002 or above, you need to click on Tools- Macros-Security and the Trusted Sources tab, then check the Trust Access to Visual Basic Project box. In this case, the macro file is included with the generic base name value of pkg.m4 instead of m4/pkg.m4.

Previously, it was common to use a variable defined in Makefile.am ( ACLOCALAMFLAGS) to pass extra parameters to aclocal. You need to run aclocal before running autoconf. If you dont do that, autoconf will not see the macro definitions for AMINITAUTOMAKEGTKHSPROGCHECKVERSION(GHCVERSION, -lt, 6.4, [ ACMSGERROR([Gtk2Hs requires GHC 6.4 or later])]). Macro definitions you wish to use in multiple source files may be defined in an include file which may be included in each source file where the macros are required. When a macro with arguments is invoked Either put the function into a header file, or enable and rely on link-time optimisation to inline it for you. In your particular case, to use forceinline, youll have define foo in a header file. This requires the definition of foo to see declarations of funca and funcb. Unlike macros, User Defined Functions (UDF) are not made accessible by merely hiding the workbook they are in, they require a reference. i.e. personal.xls!GetFormula(B3) or you can add your personal.xls to your references 9.2 Defining and Using Macros. A macro is defined as followsA macro ?Func(Arg1,ArgN) is replaced with Replacement, where all occurrences of a variable Var from the macro definition are replaced with the corresponding argument Arg. macro AMxxx not found / possibly undefined. "Please use exactly Autoconf 2.64 instead of x.yz."Note: mercurial still requires python 2.x (>2.4), but not 3.x.export accvfuncmalloc0nonnullyes export accvfuncrealloc0nonnullyes aclocal -I m4 Description of problem: autoreconf -ivf calls aclocal --force, which checks the ACCONFIG MACRODIR.But it was bug imo (if it was done silently) — user wants to know, that user defined macros are missing in distribution, when they are really missing. LTFUNCSTRIPNAMECNF required but not defined configure.ac:4: error: possibly undefined macro: AMINITAUTOMAKE If this token and others are legitimate, please use m4patternallow. Hello everybody. After updating from 4.2 to 5.0, I am getting the following message in almost every page of my application: InvalidArgumentException in UrlGenerator.php line 561: Action [email protected] not defined.autogen.sh autoreconf: Entering directory . autoreconf: configure.ac: not using Gettext autoreconf: running: aclocal --force -I m4 aclocal: macro LTDECLSED required but not defined aclocal: macro LTFUNCSTRIPNAMECNF required but not defined autoreconf: aclocal failed with exit Is there any problem with such macro definitions for lupdate? I know that tr() function does not work with defines but if it expands defs.h correctly it should work in my opinion. Note: in the scope of every function body, there is a special function-local predefined variable named func(since C11), defined as a static character array holding the name of the function in implementation-defined format. It is not a preprocessor macro Hi all, I need a small help in removal of the warning "Function xxx is defined but not used".The object files of these 30 files are required to obtain the final output binary. aclocal: macro LTFUNCSTRIPNAMECNF required but not defined. automake -a -c -f.configure.in:187: the top level. configure.in:196: warning: ACCACHEVAL(haveprettyfunction,): suspicious cache-id, must contain Thus in order to make the RequiredFieldValidator work with OnClientClick we need to make use of PageClientValidate JavaScript function of ASP.Net. defined aclocal: macro LTFUNCSTRIPNAMECNF required but not defined autoreconf: aclocal failed with exit status: 1. Griffon says func The unqualified and unadorned name of the enclosing function as a function-local static const array of char.These macros are defined in the headers for the library, so they are undefined in preprocessor directives before the required header is included. /usr/share/aclocal/nspr.m4:8: warning: underquoted definition of AMPATHNSPR /usr/share/ aclocal/nspr.m4:8: run info (automake)Extendingnot found in library configure.in:77: error: possibly undefined macro: AMOPTIONSWXCONFIG. Action: No action required. SP2-0046 columnname not defined.SP2-0055 out of room while allocating portion of new definitionname. Old definition (if any) retained.required but not defined aclocal: macro LTFUNCSTRIPNAMECNF required but not defined make[1]: [aclocal.m4] Error 1 make[1]: Leaving.Please start with THAT. Then you can continue creating your machine definition and building for whatever top secret platform you seem to be targetting. This is libtool 2.4.6, but the libtool: definition of this LTINIT comes from an older release. libtool: You should recreate aclocal.m4 withlibtoolize: Consider adding ACCONFIGMACRODIRS([m4]) to configure.in, libtoolize: and rerunning libtoolize and aclocal. libtoolize: Consider adding -I m4 to aclocal: macro LTDECLSED required but not defined aclocal: macro LTFUNCSTRIPNAMECNF required but not defined configure.ac: 92: macro AMPATHXML2 not found in library. Im fairly certain this is a path issue But in my original code I am required to use the paste function. Could anyone let me know what is the mistake in the code below using paste and as.formula functions?Posted on February 25, 2018Tags function, r, user-defined.Comment. Name. libtool: Version mismatch error. This is libtool 2.2.10, but the libtool: definition of this LTINIT comes from an older release. libtool: You should recreate aclocal.m4 with macros from libtool 2.2.10.Required fields are marked .usr/share/aclocal/ltversion.m4 /usr/share/aclocal/ltobsolete.m4 /usr/share/ aclocal/mate-common.m4 /usr/share/aclocal/mate-compiler-flags.m4 /.Edit: corrected the build-essential package name (removed trailing "s"). Edit2: On (some?) systems, at least on Mint 12, you need to explicitely install themacro LTFUNCSTRIPNAMECNF required but not defined aclocal: macro glICONVHDEFAULTS required but not defined autoreconf: aclocal failed with exit status: 1 The the missing LT macros are a bit surprising since this these are libtool macros which Im. What about this step 482 ? where is this breakpoint set ? As I try to debug some code in U-Boot, there is no main() function, but only bootstrap / relocatecode, etc. Any help much appreciated !in Makefile.am. aclocal: macro LTDECLSED required but not defined aclocal: macro LTFUNCSTRIPNAMECNF required but not definedI didnt expect it to be in the official repos because the name sounded so special. I now install it and everything works fine. Learn more about function is not defined for cell inputs fprintf, cell array, textscan MATLAB.That will cause your new definition of "problemstatement" to access the contents of the ith cell of the problemstatement cell array instead of the ith cell itself. Their source distribution is composed of .tar.bz2, a patch and a shell script to apply the patch and reconfigure / build. When "autoreconf -f -v -i" gets called, I get: aclocal: macro AMPROGMKDIRP required but not defined. I recorded a macro and then tried to run it. The macro includes repeated use of the Solver Tool, to save me some time.Here is what I did: 1) I dont know if this had any effect or not, but aclocal: Try /usr/bin/aclocal --help for more information. configure.in:49: error: possibly undefined macro: ACMSGERROR.checking for C compiler default output file name a.out. configure.ac:75 :error: possibly undefined macro: ACPROGLIBTOOL If this token is legitimate please use m4patternallow.The search path used to find the macro files is the one defined by --prefixfor file in argz libtool ltdl ltoptions ltsugar ltversion ltobsolete do ln -s /usr/share/ aclocal/file.m4 I have a problem when I try to print in word. I get a message sub or function not defined.If you are not familiar with the macro set, ask the person who created it to retify the user- defined subroutined/functions. aclocal: macro LTFUNCSTRIPNAMECNF required but not defined. aclocal failed - check that all needed development files are present on system. After a bit of googling I found that the issue was in autogen.

sh as The iPad probably doesnt support the console. You should probably define it at the top of your code as a fallback aclocal: macro LTDECLSED required but not defined aclocal: macro LTFUNCSTRIPNAMECNF required but not defined configure.ac: 92: macro AMPATHXML2 not found in library. Im fairly certain this is a path issue Version mismatch error. This is libtool 2.4 Debian-2.4-2, but the libtool: definition of this LTINIT comes from libtool 2.2.6b. libtool: You should recreate aclocal.m4 with macros from libtool 2.4 Debian-2.4-2 libtool: and run autoconf again. make[3]: [babl-base.lo] Error 63 make[3]: Leaving directory /. 755 closed defect (fixed). "possibly undefined macro: ACMSGERROR" is breaking the pyconfigure method.configure.ac: not using Gettext autoreconf: running: aclocal --force autoreconf: configure.ac: tracing autoreconf: configure.ac: not using Libtool autoreconf: running: /usr/bin/autoconf --force

related posts